HCSOH

Vibrational and/or electronic energy levels

Data compiled by: Marilyn E. Jacox

State:   X

Vib.
sym.
 No.   Approximate
 type of mode
 cm-1   Med.   Method   References

a' 1 OH stretch 3583.4 m Ar IR Schreiner, Reisenauer, et al., 2009
1 OH stretch 3578.2 Ar IR Schreiner, Reisenauer, et al., 2009
3 CS stretch 1201.3 m Ar IR Schreiner, Reisenauer, et al., 2009
4 HOS bend 971.9 m Ar IR Schreiner, Reisenauer, et al., 2009
4 HOS bend 968.7 Ar IR Schreiner, Reisenauer, et al., 2009
5 HCS bend 656.3 m Ar IR Schreiner, Reisenauer, et al., 2009
5 HCS bend 654.9 Ar IR Schreiner, Reisenauer, et al., 2009
5 HCS bend 652.5 Ar IR Schreiner, Reisenauer, et al., 2009
6 SO stretch 588.6 vs Ar IR Schreiner, Reisenauer, et al., 2009
6 SO stretch 585.2 Ar IR Schreiner, Reisenauer, et al., 2009
6 SO stretch 580.5 Ar IR Schreiner, Reisenauer, et al., 2009
a 8 HCSO deform. 972.4 m Ar IR Schreiner, Reisenauer, et al., 2009
8 HCSO deform. 970.2 Ar IR Schreiner, Reisenauer, et al., 2009

References

Schreiner, Reisenauer, et al., 2009
Schreiner, P.R.; Reisenauer, H.P.; Romanski, J.; Mloston, G., A Formal Carbon-Sulfur Triple Bond: H«63743»C«63741»S«63743»O«63743»H, Angew. Chem. Int. Ed., 2009, 48, 43, 8133, https://doi.org/10.1002/anie.200903969 . [all data]