D2CCl+

Vibrational and/or electronic energy levels

Data compiled by: Marilyn E. Jacox

State:   X

Vib.
sym.
 No.   Approximate
 type of mode
 cm-1   Med.   Method   References

a1 1 CD2 s-stretch 2170.9 w Ar IR Ma, Chen, et al., 2009
2 CD2 scissor 1140.4 s Ar IR Ma, Chen, et al., 2009
3 CCl stretch 924.3 vs Ar IR Ma, Chen, et al., 2009
b1 4 CD2 wag 871.0 w Ar IR Ma, Chen, et al., 2009
b2 5 CD2 a-stretch 2351.5 m Ar IR Ma, Chen, et al., 2009

References

Ma, Chen, et al., 2009
Ma, R.; Chen, M.; Zhou, M., Infrared Spectra of the Chloromethyl and Bromomethyl Cations in Solid Argon, J. Phys. Chem. A, 2009, 113, 46, 12926, https://doi.org/10.1021/jp9084266 . [all data]