C4N-

Vibrational and/or electronic energy levels

Data compiled by: Marilyn E. Jacox

State:   ?

 Energy
 (cm-1
 Med.   Transition   λmin
 (nm)
 λmax
 (nm)

References

Td = 25103 ± 8 gas Garand, Yacovitch, et al., 2009

Garand, Yacovitch, et al., 2009
Garand, E.; Yacovitch, T.I.; Neumark, D.M., Slow photoelectron velocity-map imaging spectroscopy of C2N-, C4N-, and C6N-, J. Chem. Phys., 2009, 130, 6, 064304, https://doi.org/10.1063/1.3076320 . [all data]