AlCCCAl

Vibrational and/or electronic energy levels

Data compiled by: Marilyn E. Jacox

State:   X

Vib.
sym.
 No.   Approximate
 type of mode
 cm-1   Med.   Method   References

Σu+ 3 1624.0 Ar IR Bates, Rittby, et al., 2008

References

Bates, Rittby, et al., 2008
Bates, S.A.; Rittby, C.M.L.; Graham, W.R.M., Fourier transform infrared observation and density functional theory study of the AlC[sub 3] and AlC[sub 3]Al linear chains trapped in solid Ar, J. Chem. Phys., 2008, 128, 23, 234301, https://doi.org/10.1063/1.2938380 . [all data]