cyc-DC3-

Vibrational and/or electronic energy levels

Data compiled by: Marilyn E. Jacox

State:   ?

 Energy
 (cm-1
 Med.   Transition   λmin
 (nm)
 λmax
 (nm)

References

Td = 16110 ± 40 gas Sheehan, Parsons, et al., 2008

Sheehan, Parsons, et al., 2008
Sheehan, S.M.; Parsons, B.F.; Zhou, J.; Garand, E.; Yen, T.A.; Moore, D.T.; Neumark, D.M., Characterization of cyclic and linear C3H- and C3H via anion photoelectron spectroscopy, J. Chem. Phys., 2008, 128, 3, 034301, https://doi.org/10.1063/1.2812561 . [all data]