cyc-C3H5

Vibrational and/or electronic energy levels

Data compiled by: Marilyn E. Jacox

State:   X

Vib.
sym.
 No.   Approximate
 type of mode
 cm-1   Med.   Method   References

a' 1 CH stretch 3118 w Ar IR Holtzhauer, Cometta-Morini, et al., 1990
2 CH2 a-stretch 3042.56 I gas LD Dong, Davis, et al., 2006
2 CH2 a-stretch 3042.12 I gas LD Dong, Davis, et al., 2006
2 CH2 a-stretch 3040.68 gas LD Dong, Davis, et al., 2006
2 CH2 a-stretch 3049 w Ar IR Holtzhauer, Cometta-Morini, et al., 1990
2 CH2 a-stretch 3042 w Ar IR Holtzhauer, Cometta-Morini, et al., 1990
3 CH2 s-stretch 2980 w Ar IR Holtzhauer, Cometta-Morini, et al., 1990
4 CH2 deform. 1440 w Ar IR Holtzhauer, Cometta-Morini, et al., 1990
5 C3 s-deform. 1237 w Ar IR Holtzhauer, Cometta-Morini, et al., 1990
6 CH2 s-torsion 1077 w Ar IR Holtzhauer, Cometta-Morini, et al., 1990
7 CH2 s-deform. 997 w Ar IR Holtzhauer, Cometta-Morini, et al., 1990
8 CC s-stretch 827 m Ar IR Holtzhauer, Cometta-Morini, et al., 1990
8 CC s-stretch 824 s Ar IR Holtzhauer, Cometta-Morini, et al., 1990
9 Mixed 743 w Ar IR Holtzhauer, Cometta-Morini, et al., 1990
a 11 CH2 a-stretch 3033 w Ar IR Holtzhauer, Cometta-Morini, et al., 1990
12 CH2 s-stretch 2965 w Ar IR Holtzhauer, Cometta-Morini, et al., 1990
13 CH2 deform. 1416 w Ar IR Holtzhauer, Cometta-Morini, et al., 1990
14 CH2 a-torsion 1229 w Ar IR Holtzhauer, Cometta-Morini, et al., 1990
15 CH deform. 1085 w Ar IR Holtzhauer, Cometta-Morini, et al., 1990
16 CH2 a-deform. 1037 m Ar IR Holtzhauer, Cometta-Morini, et al., 1990
18 Mixed 777 m Ar IR Holtzhauer, Cometta-Morini, et al., 1990

References

Holtzhauer, Cometta-Morini, et al., 1990
Holtzhauer, K.; Cometta-Morini, C.; Oth, J.F.M., Photochemical electrocyclization of the allyl radical into the cyclopropyl radical, J. Phys. Org. Chem., 1990, 3, 4, 219, https://doi.org/10.1002/poc.610030403 . [all data]

Dong, Davis, et al., 2006
Dong, F.; Davis, S.; Nesbitt, D.J., Slit Discharge IR Spectroscopy of a Jet-Cooled Cyclopropyl Radical: Structure and Intramolecular Tunneling Dynamics, J. Phys. Chem. A, 2006, 110, 9, 3059, https://doi.org/10.1021/jp053994u . [all data]