cyc-C2H2U

Vibrational and/or electronic energy levels

Data compiled by: Marilyn E. Jacox

State:   X

Vib.
sym.
 No.   Approximate
 type of mode
 cm-1   Med.   Method   References

CH stretch 2944.4 Ar IR Andrews, Kushto, et al., 2006
CH stretch 2920.1 Ar IR Andrews, Kushto, et al., 2006
CH bend 1112.1 Ar IR Andrews, Kushto, et al., 2006
CH bend 602.9 Ar IR Andrews, Kushto, et al., 2006
CUC a-stretch 521.2 Ar IR Andrews, Kushto, et al., 2006
CUC s-stretch 494.9 Ar IR Andrews, Kushto, et al., 2006

References

Andrews, Kushto, et al., 2006
Andrews, L.; Kushto, G.P.; Marsden, C.J., Reactions of Th and U Atoms with C2H2: Infrared Spectra and Relativistic Calculations of the Metallacyclopropene, Actinide Insertion, and Ethynyl Products, Chem. Eur. J., 2006, 12, 32, 8324, https://doi.org/10.1002/chem.200600075 . [all data]