cyc-(SiSiC)O

Vibrational and/or electronic energy levels

Data compiled by: Marilyn E. Jacox

State:   X

Vib.
sym.
 No.   Approximate
 type of mode
 cm-1   Med.   Method   References

1 CO stretch 1788.7 Ar IR Zhou, Jiang, et al., 2004

References

Zhou, Jiang, et al., 2004
Zhou, M.; Jiang, L.; Xu, Q., Reactions of silicon atoms and small clusters with CO: Experimental and theoretical characterization of Si[sub n]CO (n=1--5), Si[sub 2](CO)[sub 2], c-Si[sub 2](μ-O)(μ-CSi), and c-Si[sub 2](μ-O)(μ-CCO) in solid argon, J. Chem. Phys., 2004, 121, 21, 10474, https://doi.org/10.1063/1.1811078 . [all data]