cyc-(SCLa)S

Vibrational and/or electronic energy levels

Data compiled by: Marilyn E. Jacox

State:   X

Vib.
sym.
 No.   Approximate
 type of mode
 cm-1   Med.   Method   References

1 CS stretch 1044.6 Ar IR Baker and Andrews, 2006
2 La-S stretch 428.0 Ar IR Baker and Andrews, 2006

References

Baker and Andrews, 2006
Baker, A.B.; Andrews, L., Reactions of Group 3 Transition Metal Atoms with CS, J. Phys. Chem. A, 2006, 110, 35, 10419, https://doi.org/10.1021/jp063090o . [all data]