Tl(OH)3

Vibrational and/or electronic energy levels

Data compiled by: Marilyn E. Jacox

State:   X

Vib.
sym.
 No.   Approximate
 type of mode
 cm-1   Med.   Method   References

e 6 OH stretch 3612.1 Ar IR Wang and Andrews, 2007
7 OH deform. 790.3 Ar IR Wang and Andrews, 2007

References

Wang and Andrews, 2007
Wang, X.; Andrews, L., Infrared Spectroscopic Observation of the Group 13 Metal Hydroxides, M(OH), J. Phys. Chem. A, 2007, 111, 10, 1860, https://doi.org/10.1021/jp066390e . [all data]