ThNH3

Vibrational and/or electronic energy levels

Data compiled by: Marilyn E. Jacox

State:   X

Vib.
sym.
 No.   Approximate
 type of mode
 cm-1   Med.   Method   References

a1 2 NH3 deform. 1149.8 Ar IR Wang, Andrews, et al., 2007

References

Wang, Andrews, et al., 2007
Wang, X.; Andrews, L.; Marsden, C.J., Infrared Spectrum and Structure of Thorimine (HN«63742»ThH2), Chem. Eur. J., 2007, 13, 19, 5601, https://doi.org/10.1002/chem.200700183 . [all data]