SnNO

Vibrational and/or electronic energy levels

Data compiled by: Marilyn E. Jacox

State:   X

Vib.
sym.
 No.   Approximate
 type of mode
 cm-1   Med.   Method   References

1 NO stretch 1567.7 Ne IR Xu and Jiang, 2006
1 NO stretch 1560.1 Ar IR Xu and Jiang, 2006

References

Xu and Jiang, 2006
Xu, Q.; Jiang, L., Infrared Spectra of the M(NO), Inorg. Chem., 2006, 45, 21, 8648, https://doi.org/10.1021/ic061105r . [all data]