SScC=S

Vibrational and/or electronic energy levels

Data compiled by: Marilyn E. Jacox

State:   X

Vib.
sym.
 No.   Approximate
 type of mode
 cm-1   Med.   Method   References

a' 1 C=S stretch 1270.8 Ar IR Baker and Andrews, 2006
2 Sc-S stretch 535.2 Ar IR Baker and Andrews, 2006

References

Baker and Andrews, 2006
Baker, A.B.; Andrews, L., Reactions of Group 3 Transition Metal Atoms with CS, J. Phys. Chem. A, 2006, 110, 35, 10419, https://doi.org/10.1021/jp063090o . [all data]