SHfC=S

Vibrational and/or electronic energy levels

Data compiled by: Marilyn E. Jacox

State:   X

Vib.
sym.
 No.   Approximate
 type of mode
 cm-1   Med.   Method   References

a' 1 C=S stretch 1216.4 Ar IR Baker and Andrews, 2006
2 Hf-S stretch 484.9 Ar IR Baker and Andrews, 2006

References

Baker and Andrews, 2006
Baker, A.B.; Andrews, L., Group 4 Transition-Metal Atom Reactions with CS, J. Phys. Chem. A, 2006, 110, 47, 12785, https://doi.org/10.1021/jp064433l . [all data]