MoO2(OD)2

Vibrational and/or electronic energy levels

Data compiled by: Marilyn E. Jacox

State:   X

Vib.
sym.
 No.   Approximate
 type of mode
 cm-1   Med.   Method   References

OD stretch 2691.2 Ar IR Wang and Andrews, 2006
OD stretch 2688.6 Ar IR Wang and Andrews, 2006
MoO stretch 979.3 Ar IR Wang and Andrews, 2006
MoO stretch 703.2 Ar IR Wang and Andrews, 2006

References

Wang and Andrews, 2006
Wang, X.; Andrews, L., Contrasting Products in the Reactions of Cr, Mo, and W Atoms with H, J. Phys. Chem. A, 2006, 110, 35, 10409, https://doi.org/10.1021/jp063024m . [all data]