La(OH)3

Vibrational and/or electronic energy levels

Data compiled by: Marilyn E. Jacox

State:   X

Vib.
sym.
 No.   Approximate
 type of mode
 cm-1   Med.   Method   References

OH stretch 3740.6 Ar IR Wang and Andrews, 2006
LaO stretch 491.4 Ar IR Wang and Andrews, 2006

References

Wang and Andrews, 2006
Wang, X.; Andrews, L., Infrared Spectra and Density Functional Calculations for M(OH), J. Phys. Chem. A, 2006, 110, 12, 4157, https://doi.org/10.1021/jp0570263 . [all data]