HPbO

Vibrational and/or electronic energy levels

Data compiled by: Marilyn E. Jacox

State:   X

Vib.
sym.
 No.   Approximate
 type of mode
 cm-1   Med.   Method   References

1 PbH stretch 1493.8 Ar IR Teng, Jiang, et al., 2007

References

Teng, Jiang, et al., 2007
Teng, Y.-L.; Jiang, L.; Han, S.; Xu, Q., Matrix-Isolation Infrared Spectroscopic and Density Functional Theory Studies on Reactions of Laser-Ablated Lead and Tin Atoms with Water Molecules, Bull. Chem. Soc. Japan, 2007, 80, 11, 2149, https://doi.org/10.1246/bcsj.80.2149 . [all data]