HGeO

Vibrational and/or electronic energy levels

Data compiled by: Marilyn E. Jacox

State:   X

Vib.
sym.
 No.   Approximate
 type of mode
 cm-1   Med.   Method   References

1 GeH stretch 1762.9 Ar IR Teng, Jiang, et al., 2007

References

Teng, Jiang, et al., 2007
Teng, Y.-L.; Jiang, L.; Han, S.; Xu, Q., Matrix-Isolation Infrared Spectroscopic and Theoretical Studies on Reactions of Laser-Ablated Germanium Atoms with Water Molecules, J. Phys. Chem. A, 2007, 111, 28, 6225, https://doi.org/10.1021/jp072138a . [all data]