HD2O+

Vibrational and/or electronic energy levels

Data compiled by: Marilyn E. Jacox

State:   X

Vib.
sym.
 No.   Approximate
 type of mode
 cm-1   Med.   Method   References

OH stretch 3517.84 I gas LD Dong, Uy, et al., 2005
OH stretch 3500.08 I gas LD Dong, Uy, et al., 2005
OH stretch 3490.81 I gas LD Dong, Uy, et al., 2005

References

Dong, Uy, et al., 2005
Dong, F.; Uy, D.; Davis, S.; Child, M.; Nesbitt, D.J., Supersonically cooled hydronium ions in a slit-jet discharge: High-resolution infrared spectroscopy and tunneling dynamics of HD[sub 2]O[sup +], J. Chem. Phys., 2005, 122, 22, 224301, https://doi.org/10.1063/1.1924699 . [all data]