H2DO+

Vibrational and/or electronic energy levels

Data compiled by: Marilyn E. Jacox

State:   X

Vib.
sym.
 No.   Approximate
 type of mode
 cm-1   Med.   Method   References

OH s-stretch 3508.63 I gas LD Dong and Nesbitt, 2006
OH s-stretch 3475.97 I gas LD Dong and Nesbitt, 2006
OH s-stretch 3468.12 I gas LD Dong and Nesbitt, 2006
OH a-stretch 3531.50 I gas LD Dong and Nesbitt, 2006
OH a-stretch 3516.38 I gas LD Dong and Nesbitt, 2006

References

Dong and Nesbitt, 2006
Dong, F.; Nesbitt, D.J., Jet cooled spectroscopy of H[sub 2]DO[sup +]: Barrier heights and isotope-dependent tunneling dynamics from H[sub 3]O[sup +] to D[sub 3]O[sup +], J. Chem. Phys., 2006, 125, 14, 144311, https://doi.org/10.1063/1.2338520 . [all data]