H2CI+

Vibrational and/or electronic energy levels

Data compiled by: Marilyn E. Jacox

State:   a

 Energy
 (cm-1
 Med.   Transition   λmin
 (nm)
 λmax
 (nm)

References

To = 15180.7 gas a-X 580 660 Tao, Mukarakate, et al., 2006
Tao, Mukarakate, et al., 2007

Vib.
sym.
 No.   Approximate
 type of mode
 cm-1   Med.   Method   References

a1 2 CH2 scissor 1248.1 gas LF Tao, Mukarakate, et al., 2007
3 CI stretch 567 gas LF Tao, Mukarakate, et al., 2006
Tao, Mukarakate, et al., 2007

State:   X

Vib.
sym.
 No.   Approximate
 type of mode
 cm-1   Med.   Method   References

a1 2 CH2 scissors 1375 ± 2 gas LF Tao, Mukarakate, et al., 2006
Tao, Mukarakate, et al., 2007
3 CI stretch 746 ± 2 gas LF Tao, Mukarakate, et al., 2006
Tao, Mukarakate, et al., 2007
b1 4 OPLA 959 H gas LF Tao, Mukarakate, et al., 2007
b2 6 Deform. 874 H gas LF Tao, Mukarakate, et al., 2007

Tao, Mukarakate, et al., 2006
Tao, C.; Mukarakate, C.; Reid, S.A., Laser Spectroscopy of a Halocarbocation in the Gas Phase: CH, J. Am. Chem. Soc., 2006, 128, 29, 9320, https://doi.org/10.1021/ja0631293 . [all data]

Tao, Mukarakate, et al., 2007
Tao, C.; Mukarakate, C.; Mishchenko, Y.; Brusse, D.; Reid, S.A., Electronic Spectroscopy of an Isolated Halocarbocation: The Iodomethyl Cation CH, J. Phys. Chem. A, 2007, 111, 42, 10562, https://doi.org/10.1021/jp0749322 . [all data]