Ga(OD)2

Vibrational and/or electronic energy levels

Data compiled by: Marilyn E. Jacox

State:   X

Vib.
sym.
 No.   Approximate
 type of mode
 cm-1   Med.   Method   References

a1 2 Mixed 658.6 Ar IR Wang and Andrews, 2007
2 Mixed 656.1 Ar IR Wang and Andrews, 2007
b2 7 OD a-stretch 2702.6 Ar IR Wang and Andrews, 2007
9 Mixed 647.5 Ar IR Wang and Andrews, 2007
9 Mixed 646.5 Ar IR Wang and Andrews, 2007

References

Wang and Andrews, 2007
Wang, X.; Andrews, L., Infrared Spectroscopic Observation of the Group 13 Metal Hydroxides, M(OH), J. Phys. Chem. A, 2007, 111, 10, 1860, https://doi.org/10.1021/jp066390e . [all data]