DMo(O)OD

Vibrational and/or electronic energy levels

Data compiled by: Marilyn E. Jacox

State:   X

Vib.
sym.
 No.   Approximate
 type of mode
 cm-1   Med.   Method   References

1 OD stretch 2710.1 Ar IR Wang and Andrews, 2006
2 MoD stretch 1280.1 Ar IR Wang and Andrews, 2006
4 Mo-O stretch 693.7 Ar IR Wang and Andrews, 2006

References

Wang and Andrews, 2006
Wang, X.; Andrews, L., Contrasting Products in the Reactions of Cr, Mo, and W Atoms with H, J. Phys. Chem. A, 2006, 110, 35, 10409, https://doi.org/10.1021/jp063024m . [all data]