D2MoO2

Vibrational and/or electronic energy levels

Data compiled by: Marilyn E. Jacox

State:   X

Vib.
sym.
 No.   Approximate
 type of mode
 cm-1   Med.   Method   References

MoD2 a-stretch 1337.8 Ar IR Wang and Andrews, 2006
MoO2 a-stretch 985.0 Ar IR Wang and Andrews, 2006

References

Wang and Andrews, 2006
Wang, X.; Andrews, L., Contrasting Products in the Reactions of Cr, Mo, and W Atoms with H, J. Phys. Chem. A, 2006, 110, 35, 10409, https://doi.org/10.1021/jp063024m . [all data]