CrC4-

Vibrational and/or electronic energy levels

Data compiled by: Marilyn E. Jacox

State:   ?

 Energy
 (cm-1
 Med.   Transition   λmin
 (nm)
 λmax
 (nm)

References

Td = 22440 ± 120 gas Zhai, Wang, et al., 2004

Zhai, Wang, et al., 2004
Zhai, H.-J.; Wang, L.-S.; Jena, P.; Gutsev, G.L.; Bauschlicher, C.W., Jr., Competition between linear and cyclic structures in monochromium carbide clusters CrC[sub n]-] and CrC[sub n] (n=2--8): A photoelectron spectroscopy and density functional study, J. Chem. Phys., 2004, 120, 19, 8996, https://doi.org/10.1063/1.1701754 . [all data]