Co(OD)3

Vibrational and/or electronic energy levels

Data compiled by: Marilyn E. Jacox

State:   X

Vib.
sym.
 No.   Approximate
 type of mode
 cm-1   Med.   Method   References

OD stretch 2691.7 Ar IR Wang and Andrews, 2006
CoO stretch 683.9 Ar IR Wang and Andrews, 2006
CoOD deform. 430.5 Ar IR Wang and Andrews, 2006

References

Wang and Andrews, 2006
Wang, X.; Andrews, L., Infrared Spectra of M(OH), J. Phys. Chem. A, 2006, 110, 33, 10035, https://doi.org/10.1021/jp0624698 . [all data]