CdCO-

Vibrational and/or electronic energy levels

Data compiled by: Marilyn E. Jacox

State:   X

Vib.
sym.
 No.   Approximate
 type of mode
 cm-1   Med.   Method   References

1 CO stretch 1735.8 Ne IR Jiang, Teng, et al., 2006

References

Jiang, Teng, et al., 2006
Jiang, L.; Teng, Y.-L.; Xu, Q., Reactions of Laser-Ablated Zinc and Cadmium Atoms with CO: Infrared Spectra of the Zn(CO), J. Phys. Chem. A, 2006, 110, 22, 7092, https://doi.org/10.1021/jp0614852 . [all data]