CH3ScO

Vibrational and/or electronic energy levels

Data compiled by: Marilyn E. Jacox

State:   X

Vib.
sym.
 No.   Approximate
 type of mode
 cm-1   Med.   Method   References

ScO stretch 912.7 Ar IR Chen, Huang, et al., 2004

References

Chen, Huang, et al., 2004
Chen, M.; Huang, Z.; Zhou, M., Matrix Isolation Infrared Spectroscopic and Density Functional Theoretical Studies of the Reactions of Scandium Atoms with Methanol, J. Phys. Chem. A, 2004, 108, 28, 5950, https://doi.org/10.1021/jp048348u . [all data]