CH3BeOH

Vibrational and/or electronic energy levels

Data compiled by: Marilyn E. Jacox

State:   X

Vib.
sym.
 No.   Approximate
 type of mode
 cm-1   Med.   Method   References

OH stretch 3832.0 Ar IR Huang, Chen, et al., 2004
BeO stretch 1376.1 Ar IR Huang, Chen, et al., 2004
CH3 deform. 685.4 Ar IR Huang, Chen, et al., 2004
CH3 deform. 683.4 Ar IR Huang, Chen, et al., 2004

References

Huang, Chen, et al., 2004
Huang, Z.; Chen, M.; Zhou, M., Matrix Isolation Infrared Spectroscopic and Theoretical Study of the Reactions of Beryllium Atoms with Methanol, J. Phys. Chem. A, 2004, 108, 16, 3390, https://doi.org/10.1021/jp038028v . [all data]