CD3UD

Vibrational and/or electronic energy levels

Data compiled by: Marilyn E. Jacox

State:   X

Vib.
sym.
 No.   Approximate
 type of mode
 cm-1   Med.   Method   References

UD stretch 977.4 Ar IR Lyon, Andrews, et al., 2007

References

Lyon, Andrews, et al., 2007
Lyon, J.T.; Andrews, L.; Malmqvist, P.-A.; Roos, B.O.; Yang, T.; Bursten, B.E., Infrared Spectrum and Bonding in Uranium Methylidene Dihydride, CH, Inorg. Chem., 2007, 46, 12, 4917, https://doi.org/10.1021/ic062407w . [all data]