CD3FeOD

Vibrational and/or electronic energy levels

Data compiled by: Marilyn E. Jacox

State:   X

Vib.
sym.
 No.   Approximate
 type of mode
 cm-1   Med.   Method   References

OD stretch 2759.6 Ar IR Park, Hauge, et al., 1985
FeO stretch 667.3 Ar IR Park, Hauge, et al., 1985

References

Park, Hauge, et al., 1985
Park, M.; Hauge, R.H.; Kafafi, Z.H.; Margrave, J.L., J. Chem. Soc., 1985, Chem. Commun. 1570. [all data]