C6H5CN+

Vibrational and/or electronic energy levels

Data compiled by: Marilyn E. Jacox

State:   B

 Energy
 (cm-1
 Med.   Transition   λmin
 (nm)
 λmax
 (nm)

References

To = 17225 gas Xu, Johnson, et al., 2006

Vib.
sym.
 No.   Approximate
 type of mode
 cm-1   Med.   Method   References

a1 7 1036 gas PRI Xu, Johnson, et al., 2006
8 986 gas PRI Xu, Johnson, et al., 2006
9 886 gas PRI Xu, Johnson, et al., 2006
10 760 gas PRI Xu, Johnson, et al., 2006
11 678 gas PRI Xu, Johnson, et al., 2006
12 411 gas PRI Xu, Johnson, et al., 2006
a2 13 713 gas PRI Xu, Johnson, et al., 2006
14 648 gas PRI Xu, Johnson, et al., 2006
15 214 gas PRI Xu, Johnson, et al., 2006
b1 18 689 gas PRI Xu, Johnson, et al., 2006
19 509 gas PRI Xu, Johnson, et al., 2006
20 480 gas PRI Xu, Johnson, et al., 2006
21 CN wag 265 gas PRI Xu, Johnson, et al., 2006
22 185 gas PRI Xu, Johnson, et al., 2006
b2 29 941 gas PRI Xu, Johnson, et al., 2006
30 853 gas PRI Xu, Johnson, et al., 2006
31 566 gas PRI Xu, Johnson, et al., 2006
32 CN rock 403 gas PRI Xu, Johnson, et al., 2006
33 112 gas PRI Xu, Johnson, et al., 2006

State:   X

Vib.
sym.
 No.   Approximate
 type of mode
 cm-1   Med.   Method   References

a1 CN stretch 2136 gas TPI Kwon, Kim, et al., 2003
(8a) 1612 gas TPI Kwon, Kim, et al., 2003
(19a) 1413 gas TPI Kwon, Kim, et al., 2003
(13) 1223 gas TPI Kwon, Kim, et al., 2003
(9a) 1168 gas TPI Kwon, Kim, et al., 2003
(12) 968 gas TPI Kwon, Kim, et al., 2003
(18a) 959 gas TPI Kwon, Kim, et al., 2003
(1) 737 gas TPI Kwon, Kim, et al., 2003
(6a) 438 gas TPE TPI Araki and Sato, 1996
Kwon, Kim, et al., 2003
a2 (17a) 984 gas TPE TPI Araki and Sato, 1996
Kwon, Kim, et al., 2003
(10a) 771 gas TPI Kwon, Kim, et al., 2003
(16a) 336 gas TPE TPI Araki and Sato, 1996
Kwon, Kim, et al., 2003
b1 (5) 1034 gas TPE TPI Araki and Sato, 1996
Kwon, Kim, et al., 2003
(17b) 922 gas TPE TPI Araki and Sato, 1996
Kwon, Kim, et al., 2003
(11) 771 gas TPI Kwon, Kim, et al., 2003
(4) 606 gas TPI Kwon, Kim, et al., 2003
(16b) 412 gas TPE TPI Araki and Sato, 1996
Kwon, Kim, et al., 2003
CN wag 291 gas TPI Kwon, Kim, et al., 2003
(10b) 111 gas TPE TPI Araki and Sato, 1996
Kwon, Kim, et al., 2003
b2 (19b) 1470 gas TPI Kwon, Kim, et al., 2003
(3) 1386 gas TPI Kwon, Kim, et al., 2003
(14) 1353 gas TPI Kwon, Kim, et al., 2003
(9b) 1111 gas TPI Kwon, Kim, et al., 2003
(6b) 559 gas TPE Araki and Sato, 1996
CN rock 536 gas TPE TPI Araki and Sato, 1996
Kwon, Kim, et al., 2003
(15) 143 gas TPE TPI Araki and Sato, 1996
Kwon, Kim, et al., 2003

Xu, Johnson, et al., 2006
Xu, H.; Johnson, P.M.; Sears, T.J., Photoinduced Rydberg ionization spectroscopy of the B state of benzonitrile cation, J. Chem. Phys., 2006, 125, 16, 164331, https://doi.org/10.1063/1.2355675 . [all data]

Kwon, Kim, et al., 2003
Kwon, C.H.; Kim, H.L.; Kim, M.S., Vibrational Analysis of Vacuum Ultraviolet Mass-Analyzed Threshold Ionization Spectra of Phenylacetylene and Benzonitrile, J. Phys. Chem. A, 2003, 107, 50, 10969, https://doi.org/10.1021/jp036391w . [all data]

Araki and Sato, 1996
Araki, M.; Sato, S.-i., Two-color zero kinetic energy photoelectron spectra of benzonitrile and its van der Waals complexes with argon. Adiabatic ionization potentials and cation vibrational frequencies, J. Phys. Chem., 1996, 100, 10542. [all data]