cyc-C8+

Vibrational and/or electronic energy levels

Data compiled by: Marilyn E. Jacox

State:   E

 Energy
 (cm-1
 Med.   Transition   λmin
 (nm)
 λmax
 (nm)

References

To = 29718 Ne E-X 325 337 Fulara, Shnitko, et al., 2005

Vib.
sym.
 No.   Approximate
 type of mode
 cm-1   Med.   Method   References

ag 2 973 Ne AB Fulara, Shnitko, et al., 2005
bg 7 114 H Ne AB Fulara, Shnitko, et al., 2005
bu 11 242 H Ne AB Fulara, Shnitko, et al., 2005

State:   D

 Energy
 (cm-1
 Med.   Transition   λmin
 (nm)
 λmax
 (nm)

To = 26163 Ne D-X 345 382 Fulara, Shnitko, et al., 2005

Vib.
sym.
 No.   Approximate
 type of mode
 cm-1   Med.   Method   References

ag 1 1860 Ne AB Fulara, Shnitko, et al., 2005
2 948 Ne AB Fulara, Shnitko, et al., 2005
3 700 Ne AB Fulara, Shnitko, et al., 2005
bg 7 102 H Ne AB Fulara, Shnitko, et al., 2005
bu 11 227 H Ne AB Fulara, Shnitko, et al., 2005

State:   C

 Energy
 (cm-1
 Med.   Transition   λmin
 (nm)
 λmax
 (nm)

To = 21490 Ne C-X 433 465 Fulara, Shnitko, et al., 2005

Vib.
sym.
 No.   Approximate
 type of mode
 cm-1   Med.   Method   References

ag 1 1578 Ne AB Fulara, Shnitko, et al., 2005

State:   B

 Energy
 (cm-1
 Med.   Transition   λmin
 (nm)
 λmax
 (nm)

To = 17164 Ne B-X 530 583 Fulara, Shnitko, et al., 2005

Vib.
sym.
 No.   Approximate
 type of mode
 cm-1   Med.   Method   References

ag 1 1599 Ne AB Fulara, Shnitko, et al., 2005

State:   A

 Energy
 (cm-1
 Med.   Transition   λmin
 (nm)
 λmax
 (nm)

To = 12630 Ne A-X 687 792 Fulara, Shnitko, et al., 2005

Vib.
sym.
 No.   Approximate
 type of mode
 cm-1   Med.   Method   References

ag 1 1924 Ne AB Fulara, Shnitko, et al., 2005

Fulara, Shnitko, et al., 2005
Fulara, J.; Shnitko, I.; Batalov, A.; Maier, J.P., Electronic absorption spectra of linear and cyclic C[sub n][sup +] n=7--9 in a neon matrix, J. Chem. Phys., 2005, 123, 4, 044305, https://doi.org/10.1063/1.1942493 . [all data]