cyc-C3Cl

Vibrational and/or electronic energy levels

Data compiled by: Marilyn E. Jacox

State:   1 2A1

 Energy
 (cm-1
 Med.   Transition   λmin
 (nm)
 λmax
 (nm)

References

To = 9552 ± 2 Ne 2A1-X 865 1047 van Wijngaarden, Shnitko, et al., 2005

Vib.
sym.
 No.   Approximate
 type of mode
 cm-1   Med.   Method   References

a1 1 1607 ± 2 Ne AB van Wijngaarden, Shnitko, et al., 2005
2 1119 ± 2 Ne AB van Wijngaarden, Shnitko, et al., 2005
3 718 H Ne AB van Wijngaarden, Shnitko, et al., 2005
4 CCl stretch 576 ± 2 Ne AB van Wijngaarden, Shnitko, et al., 2005
5 480 H Ne AB van Wijngaarden, Shnitko, et al., 2005
6 441 H Ne AB van Wijngaarden, Shnitko, et al., 2005

van Wijngaarden, Shnitko, et al., 2005
van Wijngaarden, J.; Shnitko, I.; Batalov, A.; Kolek, P.; Fulara, J.; Maier, J.P., Electronic Absorption Spectra of C, J. Phys. Chem. A, 2005, 109, 25, 5553, https://doi.org/10.1021/jp051514t . [all data]