cyc-(OCoO)Co

Vibrational and/or electronic energy levels

Data compiled by: Marilyn E. Jacox

State:   X

Vib.
sym.
 No.   Approximate
 type of mode
 cm-1   Med.   Method   References

985.5 Ar IR Danset and Manceron, 2005
950.2 Ar IR Danset and Manceron, 2005
551.5 Ar IR Danset and Manceron, 2005

References

Danset and Manceron, 2005
Danset, D.; Manceron, L., Reactivity of cobalt dimer and molecular oxygen in rare gas matrices. IR spectrum, photophysics and structure of Co2O2, Phys. Chem. Chem. Phys., 2005, 7, 4, 583, https://doi.org/10.1039/b415420g . [all data]