c,perp-HOONO

Vibrational and/or electronic energy levels

Data compiled by: Marilyn E. Jacox

State:   ?

 Energy
 (cm-1
 Med.   Transition   λmin
 (nm)
 λmax
 (nm)

References

Tx = 6970 T gas Nizkorodov and Wennberg, 2002
McCoy, Fry, et al., 2005

Nizkorodov and Wennberg, 2002
Nizkorodov, S.A.; Wennberg, P.O., First Spectroscopic Observation of Gas-Phase HOONO, J. Phys. Chem. A, 2002, 106, 6, 855, https://doi.org/10.1021/jp013598l . [all data]

McCoy, Fry, et al., 2005
McCoy, A.B.; Fry, J.L.; Francisco, J.S.; Mollner, A.K.; Okumura, M., Role of OH-stretch/torsion coupling and quantum yield effects in the first OH overtone spectrum of cis-cis HOONO, J. Chem. Phys., 2005, 122, 10, 104311, https://doi.org/10.1063/1.1859273 . [all data]