Th(OH)2

Vibrational and/or electronic energy levels

Data compiled by: Marilyn E. Jacox

State:   X

Vib.
sym.
 No.   Approximate
 type of mode
 cm-1   Med.   Method   References

b2 7 OH stretch 3737.8 Ar IR Wang and Andrews, 2005
8 ThO stretch 552.6 Ar IR Wang and Andrews, 2005

References

Wang and Andrews, 2005
Wang, X.; Andrews, L., Infrared spectra and structures of the Th(OH)2 and Th(OH)4 molecules, Phys. Chem. Chem. Phys., 2005, 7, 22, 3834, https://doi.org/10.1039/b509401a . [all data]