SrH2

Vibrational and/or electronic energy levels

Data compiled by: Marilyn E. Jacox

State:   X

Vib.
sym.
 No.   Approximate
 type of mode
 cm-1   Med.   Method   References

a1 1 Sym. stretch 1202.1 Ar IR Wang and Andrews, 2004
1 Sym. stretch 1126.4 p-H2 IR Wang and Andrews, 2004
b2 3 Asym. stretch 1100.4 Ne IR Wang and Andrews, 2004
3 Asym. stretch 1092.8 Ne IR Wang and Andrews, 2004
3 Asym. stretch 1132.4 Ar IR Wang and Andrews, 2004
3 Asym. stretch 1106.6 p-H2 IR Wang and Andrews, 2004
3 Asym. stretch 1099.5 H2 IR Wang and Andrews, 2004
3 Asym. stretch 1093.5 H2 IR Wang and Andrews, 2004

References

Wang and Andrews, 2004
Wang, X.; Andrews, L., Metal Dihydride (MH, J. Phys. Chem. A, 2004, 108, 52, 11500, https://doi.org/10.1021/jp046046m . [all data]