SiNSiO

Vibrational and/or electronic energy levels

Data compiled by: Marilyn E. Jacox

State:   X

Vib.
sym.
 No.   Approximate
 type of mode
 cm-1   Med.   Method   References

SiN stretch 1340.9 Ar IR Zhou, Jiang, et al., 2004
SiO stretch 1142.8 Ar IR Zhou, Jiang, et al., 2004
Bend 580.3 Ar IR Zhou, Jiang, et al., 2004

References

Zhou, Jiang, et al., 2004
Zhou, M.; Jiang, L.; Xu, Q., Reactions of Silicon Atoms with NO. Experimental and Theoretical Characterization of Molecules Containing Si, N, and O, J. Phys. Chem. A, 2004, 108, 44, 9521, https://doi.org/10.1021/jp047057i . [all data]