PtCN-

Vibrational and/or electronic energy levels

Data compiled by: Marilyn E. Jacox

State:   X

 Energy
 (cm-1
 Med.   Transition   λmin
 (nm)
 λmax
 (nm)

References

Td = 25750 ± 40 gas Chatterjee, Akin, et al., 2005

Chatterjee, Akin, et al., 2005
Chatterjee, B.; Akin, F.A.; Jarrold, C.C.; Raghavachari, K., Comparison of Nickel-Group Metal Cyanides and Acetylides and Their Anions Using Anion Photoelectron Spectroscopy and Density Functional Theory Calculations, J. Phys. Chem. A, 2005, 109, 31, 6880, https://doi.org/10.1021/jp0520704 . [all data]