PH2-

Vibrational and/or electronic energy levels

Data compiled by: Marilyn E. Jacox

State:   ?

 Energy
 (cm-1
 Med.   Transition   λmin
 (nm)
 λmax
 (nm)

References

Td = 10190 ± 50 gas Smyth and Brauman, 1972
Zittel and Lineberger, 1976
Ervin and Lineberger, 2005

Smyth and Brauman, 1972
Smyth, K.C.; Brauman, J.I., Photodetachment of electrons from phosphide ion the electron affinity of PH2-, J. Chem. Phys., 1972, 56, 1132. [all data]

Zittel and Lineberger, 1976
Zittel, P.F.; Lineberger, W.C., Laser photoelectron spectrometry of PO-, PH-, and PH2-, J. Chem. Phys., 1976, 65, 1236. [all data]

Ervin and Lineberger, 2005
Ervin, K.M.; Lineberger, W.C., Photoelectron spectroscopy of phosphorus hydride anions, J. Chem. Phys., 2005, 122, 19, 194303, https://doi.org/10.1063/1.1881153 . [all data]