O(CS2)

Vibrational and/or electronic energy levels

Data compiled by: Marilyn E. Jacox

State:   X

Vib.
sym.
 No.   Approximate
 type of mode
 cm-1   Med.   Method   References

1 C=O stretch 1824.7 Ar IR Lo, Chen, et al., 2004
3 OCS bend 617.8 Ar IR Lo, Chen, et al., 2004

References

Lo, Chen, et al., 2004
Lo, W.-J.; Chen, H.-F.; Chou, P.-H.; Lee, Y.-P., Isomers of OCS[sub 2]: IR absorption spectra of OSCS and O(CS[sub 2]) in solid Ar, J. Chem. Phys., 2004, 121, 24, 12371, https://doi.org/10.1063/1.1822919 . [all data]