NiCH3

Vibrational and/or electronic energy levels

Data compiled by: Marilyn E. Jacox

State:   ?

 Energy
 (cm-1
 Med.   Transition   λmin
 (nm)
 λmax
 (nm)

References

To = 16107.42 ± 0.07 gas 574 621 Brugh, DaBell, et al., 2004

State:   ?

Vib.
sym.
 No.   Approximate
 type of mode
 cm-1   Med.   Method   References

a1 3 NiC stretch 455.3 w gas MPI Brugh, DaBell, et al., 2004

State:   X

Vib.
sym.
 No.   Approximate
 type of mode
 cm-1   Med.   Method   References

a1 3 NiC stretch 566 ± 2 w gas LF Brugh, DaBell, et al., 2004

Brugh, DaBell, et al., 2004
Brugh, D.J.; DaBell, R.S.; Morse, M.D., Vibronic spectroscopy of unsaturated transition metal complexes: CrC[sub 2]H, CrCH[sub 3], and NiCH[sub 3], J. Chem. Phys., 2004, 121, 24, 12379, https://doi.org/10.1063/1.1821497 . [all data]