MoH6

Vibrational and/or electronic energy levels

Data compiled by: Marilyn E. Jacox

State:   X

Vib.
sym.
 No.   Approximate
 type of mode
 cm-1   Med.   Method   References

e MoH stretch 1993.7 Ne IR Wang and Andrews, 2005
MoH stretch 1882.0 Ne IR Wang and Andrews, 2005
MoH stretch 1857.6 Ar IR Wang and Andrews, 2005

References

Wang and Andrews, 2005
Wang, X.; Andrews, L., Matrix Infrared Spectra and Density Functional Theory Calculations of Molybdenum Hydrides, J. Phys. Chem. A, 2005, 109, 40, 9021, https://doi.org/10.1021/jp053591u . [all data]