Mg2H3

Vibrational and/or electronic energy levels

Data compiled by: Marilyn E. Jacox

State:   X

Vib.
sym.
 No.   Approximate
 type of mode
 cm-1   Med.   Method   References

MgH stretch 1114.6 Ne IR Wang and Andrews, 2004
MgH stretch 1106.8 p-H2 IR Wang and Andrews, 2004
MgH stretch 1105.9 H2 IR Wang and Andrews, 2004
986.1 p-H2 IR Wang and Andrews, 2004
985.5 H2 IR Wang and Andrews, 2004

References

Wang and Andrews, 2004
Wang, X.; Andrews, L., Infrared Spectra of Magnesium Hydride Molecules, Complexes, and Solid Magnesium Dihydride, J. Phys. Chem. A, 2004, 108, 52, 11511, https://doi.org/10.1021/jp046410h . [all data]