InOBO

Vibrational and/or electronic energy levels

Data compiled by: Marilyn E. Jacox

State:   X

Vib.
sym.
 No.   Approximate
 type of mode
 cm-1   Med.   Method   References

Σ+ 1 InO stretch 1979.9 Ar IR Wang, Chen, et al., 2005

References

Wang, Chen, et al., 2005
Wang, G.; Chen, M.; Jiang, G.; Zhou, H.; Zhou, M., Matrix isolation infrared spectroscopic and density functional theoretical study of the aluminum, gallium and indium borates, Chem. Phys., 2005, 313, 1-3, 325, https://doi.org/10.1016/j.chemphys.2005.01.024 . [all data]