Hg(OH)2

Vibrational and/or electronic energy levels

Data compiled by: Marilyn E. Jacox

State:   X

Vib.
sym.
 No.   Approximate
 type of mode
 cm-1   Med.   Method   References

b OH stretch 3642.3 Ne IR Wang and Andrews, 2005
OH stretch 3629.4 Ar IR Wang and Andrews, 2005
Wang and Andrews, 2005, 2
HgOH a-deform. 928.8 Ne IR Wang and Andrews, 2005
HgOH a-deform. 927.1 Ar IR Wang and Andrews, 2005
Wang and Andrews, 2005, 2
OHgO a-stretch 644.2 Ne IR Wang and Andrews, 2005
OHgO a-stretch 637.3 Ar IR Wang and Andrews, 2005
Wang and Andrews, 2005, 2

References

Wang and Andrews, 2005
Wang, X.; Andrews, L., Infrared Spectrum of Hg(OH), Inorg. Chem., 2005, 44, 1, 108, https://doi.org/10.1021/ic048673w . [all data]

Wang and Andrews, 2005, 2
Wang, X.; Andrews, L., Zinc and Cadmium Dihydroxide Molecules: Matrix Infrared Spectra and Theoretical Calculations, J. Phys. Chem. A, 2005, 109, 17, 3849, https://doi.org/10.1021/jp050362z . [all data]