Hg(OD)2

Vibrational and/or electronic energy levels

Data compiled by: Marilyn E. Jacox

State:   X

Vib.
sym.
 No.   Approximate
 type of mode
 cm-1   Med.   Method   References

b OD stretch 2684.0 Ne IR Wang and Andrews, 2005
OD stretch 2677.7 Ar IR Wang and Andrews, 2005
OD stretch 2679.6 D2 IR Wang and Andrews, 2005
HgOD a-deform. 711.5 Ne IR Wang and Andrews, 2005
HgOD a-deform. 704.5 Ar IR Wang and Andrews, 2005
HgOD a-deform. 709.4 D2 IR Wang and Andrews, 2005
OHgO a-stretch 619.9 Ne IR Wang and Andrews, 2005
OHgO a-stretch 617.9 D2 IR Wang and Andrews, 2005

References

Wang and Andrews, 2005
Wang, X.; Andrews, L., Infrared Spectrum of Hg(OH), Inorg. Chem., 2005, 44, 1, 108, https://doi.org/10.1021/ic048673w . [all data]