HPBr

Vibrational and/or electronic energy levels

Data compiled by: Marilyn E. Jacox

State:   A

 Energy
 (cm-1
 Med.   Transition   λmin
 (nm)
 λmax
 (nm)

References

To = 20912.41 gas A-X 442 713 Tackett and Clouthier, 2005

Vib.
sym.
 No.   Approximate
 type of mode
 cm-1   Med.   Method   References

a' 2 Bend 583.1 gas LF Tackett and Clouthier, 2005
3 PBr stretch 430.5 gas LF Tackett and Clouthier, 2005

State:   X

Vib.
sym.
 No.   Approximate
 type of mode
 cm-1   Med.   Method   References

a' 2 Bend 832.9 gas LF Tackett and Clouthier, 2005
3 PBr stretch 417.1 gas LF Tackett and Clouthier, 2005

Tackett and Clouthier, 2005
Tackett, B.S.; Clouthier, D.J., Observation of a new phosphorus-containing reactive intermediate: Electronic spectroscopy and excited-state dynamics of the HPBr free radical, J. Chem. Phys., 2005, 123, 14, 144304, https://doi.org/10.1063/1.2055227 . [all data]