HGaSnH3

Vibrational and/or electronic energy levels

Data compiled by: Marilyn E. Jacox

State:   X

Vib.
sym.
 No.   Approximate
 type of mode
 cm-1   Med.   Method   References

a' 1 1849.3 Ar IR Gaertner, Himmel, et al., 2004
2 1824.7 Ar IR Gaertner, Himmel, et al., 2004
3 1734.4 Ar IR Gaertner, Himmel, et al., 2004
4 714.8 Ar IR Gaertner, Himmel, et al., 2004
5 650.4 Ar IR Gaertner, Himmel, et al., 2004
6 496.8 Ar IR Gaertner, Himmel, et al., 2004
a 9 1835.3 Ar IR Gaertner, Himmel, et al., 2004
10 724.8 Ar IR Gaertner, Himmel, et al., 2004

References

Gaertner, Himmel, et al., 2004
Gaertner, B.; Himmel, H.-J.; Macrae, V.A.; Pardoe, J.A.J.; Randall, P.G.; Downs, A.J., Some Novel Binuclear Group 13 Metal Tin Hydrides Formed in Ar Matrices Following the Codeposition of the Metal Vapor with SnH4, Chem. Eur. J., 2004, 10, 22, 5836, https://doi.org/10.1002/chem.200400564 . [all data]